Target
Vacuolar aminopeptidase 1
Ligand
BDBM66038
Substrate
Meas. Tech.
Dose Response of TOR pathway GFP-fusion proteins in Saccharomyes cerevisiae specifically LAP4 based on MLPCN hits
EC50
3901±n/a nM
Citation
 PubChem, PC Dose Response of TOR pathway GFP-fusion proteins in Saccharomyes cerevisiae specifically LAP4 based on MLPCN hits PubChem Bioassay (2010)[AID] 
Target
Name:
Vacuolar aminopeptidase 1
Synonyms:
AMPL_YEAST API YSC1
Type:
Enzyme Catalytic Domain
Mol. Mass.:
57084.90
Organism:
Saccharomyces cerevisiae
Description:
gi_486173
Residue:
514
  
Inhibitor
Name:
BDBM66038
Synonyms:
MLS000100919 N-[4-(2-pyridinyl)-2-thiazolyl]-2,3-dihydro-1,4-benzodioxin-3-carboxamide SMR000017436 | cid_4357675
Type:
Small organic molecule
Emp. Form.:
C17H13N3O3S
Mol. Mass.:
339.368
SMILES:
O=C(Nc1nc(cs1)-c1ccccn1)C1COc2ccccc2O1
: