Target
Vacuolar aminopeptidase 1
Ligand
BDBM65993
Substrate
Meas. Tech.
Dose Response of TOR pathway GFP-fusion proteins in Saccharomyes cerevisiae specifically LAP4 based on MLPCN hits
EC50
4409±n/a nM
Citation
 PubChem, PC Dose Response of TOR pathway GFP-fusion proteins in Saccharomyes cerevisiae specifically LAP4 based on MLPCN hits PubChem Bioassay (2010)[AID] 
Target
Name:
Vacuolar aminopeptidase 1
Synonyms:
AMPL_YEAST API YSC1
Type:
Enzyme Catalytic Domain
Mol. Mass.:
57084.90
Organism:
Saccharomyces cerevisiae
Description:
gi_486173
Residue:
514
  
Inhibitor
Name:
BDBM65993
Synonyms:
2-[1-[(E)-2-nitrovinyl]-2-naphthoxy]acetic acid ethyl ester MLS000584937 cid_684448 ethyl 2-[1-[(E)-2-nitroethenyl]naphthalen-2-yl]oxyacetate | ethyl 2-[1-[(E)-2-nitroethenyl]naphthalen-2-yl]oxyethanoate
Type:
Small organic molecule
Emp. Form.:
C16H15NO5
Mol. Mass.:
301.294
SMILES:
CCOC(=O)COc1ccc2ccccc2c1\C=C\[N+]([O-])=O
: