Target
Vacuolar aminopeptidase 1
Ligand
BDBM576
Substrate
Meas. Tech.
Dose Response of TOR pathway GFP-fusion proteins in Saccharomyes cerevisiae specifically LAP4 based on MLPCN hits
EC50
2697±n/a nM
Citation
 PubChem, PC Dose Response of TOR pathway GFP-fusion proteins in Saccharomyes cerevisiae specifically LAP4 based on MLPCN hits PubChem Bioassay (2010)[AID] 
Target
Name:
Vacuolar aminopeptidase 1
Synonyms:
AMPL_YEAST API YSC1
Type:
Enzyme Catalytic Domain
Mol. Mass.:
57084.90
Organism:
Saccharomyces cerevisiae
Description:
gi_486173
Residue:
514
  
Inhibitor
Name:
BDBM576
Synonyms:
1-Diphenylamino-pyrrole-2,5-dione SMR000217435 | cid_909748
Type:
Emp. Form.:
C16H12N2O2
Mol. Mass.:
264.2787
SMILES:
O=C1C=CC(=O)N1N(c1ccccc1)c1ccccc1
: