Target
Vacuolar aminopeptidase 1
Ligand
BDBM65455
Substrate
Meas. Tech.
Dose Response of TOR pathway GFP-fusion proteins in Saccharomyes cerevisiae specifically LAP4 based on MLPCN hits
EC50
6149±n/a nM
Citation
 PubChem, PC Dose Response of TOR pathway GFP-fusion proteins in Saccharomyes cerevisiae specifically LAP4 based on MLPCN hits PubChem Bioassay (2010)[AID] 
Target
Name:
Vacuolar aminopeptidase 1
Synonyms:
AMPL_YEAST API YSC1
Type:
Enzyme Catalytic Domain
Mol. Mass.:
57084.90
Organism:
Saccharomyces cerevisiae
Description:
gi_486173
Residue:
514
  
Inhibitor
Name:
BDBM65455
Synonyms:
3-methyl-4-nitro-N-(4-pyridin-2-yl-1,3-thiazol-2-yl)benzamide 3-methyl-4-nitro-N-[4-(2-pyridyl)thiazol-2-yl]benzamide SMR000363739 | cid_3898532
Type:
Small organic molecule
Emp. Form.:
C16H12N4O3S
Mol. Mass.:
340.356
SMILES:
Cc1cc(ccc1[N+]([O-])=O)C(=O)Nc1nc(cs1)-c1ccccn1
: