Target
Vacuolar aminopeptidase 1
Ligand
BDBM66011
Substrate
Meas. Tech.
Dose Response of TOR pathway GFP-fusion proteins in Saccharomyes cerevisiae specifically LAP4 based on MLPCN hits
EC50
3481±n/a nM
Citation
 PubChem, PC Dose Response of TOR pathway GFP-fusion proteins in Saccharomyes cerevisiae specifically LAP4 based on MLPCN hits PubChem Bioassay (2010)[AID] 
Target
Name:
Vacuolar aminopeptidase 1
Synonyms:
AMPL_YEAST API YSC1
Type:
Enzyme Catalytic Domain
Mol. Mass.:
57084.90
Organism:
Saccharomyces cerevisiae
Description:
gi_486173
Residue:
514
  
Inhibitor
Name:
BDBM66011
Synonyms:
(4E)-4-[(5-methyl-2-furanyl)methylidene]-3-phenyl-5-isoxazolone (4E)-4-[(5-methylfuran-2-yl)methylidene]-3-phenyl-1,2-oxazol-5-one MLS000769185 cid_699724
Type:
Small organic molecule
Emp. Form.:
C15H11NO3
Mol. Mass.:
253.2527
SMILES:
Cc1ccc(\C=C2\C(=O)ON=C2c2ccccc2)o1
: