Target
Vacuolar aminopeptidase 1
Ligand
BDBM66065
Substrate
Meas. Tech.
Dose Response of TOR pathway GFP-fusion proteins in Saccharomyes cerevisiae specifically LAP4 based on MLPCN hits
EC50
1187±n/a nM
Citation
 PubChem, PC Dose Response of TOR pathway GFP-fusion proteins in Saccharomyes cerevisiae specifically LAP4 based on MLPCN hits PubChem Bioassay (2010)[AID] 
Target
Name:
Vacuolar aminopeptidase 1
Synonyms:
AMPL_YEAST API YSC1
Type:
Enzyme Catalytic Domain
Mol. Mass.:
57084.90
Organism:
Saccharomyces cerevisiae
Description:
gi_486173
Residue:
514
  
Inhibitor
Name:
BDBM66065
Synonyms:
5-fluoranyl-7-nitro-quinolin-8-ol 5-fluoro-7-nitro-quinolin-8-ol MLS000736929 cid_260644
Type:
Small organic molecule
Emp. Form.:
C9H5FN2O3
Mol. Mass.:
208.146
SMILES:
Oc1c(cc(F)c2cccnc12)[N+]([O-])=O
: