Target
Vacuolar aminopeptidase 1
Ligand
BDBM60786
Substrate
Meas. Tech.
Dose Response of TOR pathway GFP-fusion proteins in Saccharomyes cerevisiae specifically LAP4 based on MLPCN hits
EC50
4472±n/a nM
Citation
 PubChem, PC Dose Response of TOR pathway GFP-fusion proteins in Saccharomyes cerevisiae specifically LAP4 based on MLPCN hits PubChem Bioassay (2010)[AID] 
Target
Name:
Vacuolar aminopeptidase 1
Synonyms:
AMPL_YEAST API YSC1
Type:
Enzyme Catalytic Domain
Mol. Mass.:
57084.90
Organism:
Saccharomyces cerevisiae
Description:
gi_486173
Residue:
514
  
Inhibitor
Name:
BDBM60786
Synonyms:
(4Z)-4-[(5-methyl-2-furanyl)methylidene]-3-(4-methylphenyl)-5-isoxazolone (4Z)-4-[(5-methylfuran-2-yl)methylidene]-3-(4-methylphenyl)-1,2-oxazol-5-one MLS001043228 cid_1716445
Type:
Small organic molecule
Emp. Form.:
C16H13NO3
Mol. Mass.:
267.2793
SMILES:
Cc1ccc(\C=C2/C(=O)ON=C2c2ccc(C)cc2)o1
: