Target
Vacuolar aminopeptidase 1
Ligand
BDBM60985
Substrate
Meas. Tech.
Dose Response of TOR pathway GFP-fusion proteins in Saccharomyes cerevisiae specifically LAP4 based on MLPCN hits
EC50
8923±n/a nM
Citation
 PubChem, PC Dose Response of TOR pathway GFP-fusion proteins in Saccharomyes cerevisiae specifically LAP4 based on MLPCN hits PubChem Bioassay (2010)[AID] 
Target
Name:
Vacuolar aminopeptidase 1
Synonyms:
AMPL_YEAST API YSC1
Type:
Enzyme Catalytic Domain
Mol. Mass.:
57084.90
Organism:
Saccharomyces cerevisiae
Description:
gi_486173
Residue:
514
  
Inhibitor
Name:
BDBM60985
Synonyms:
1-hydroxy-2-pyridinethione 1-oxidanylpyridine-2-thione SMR000814708 | cid_1570
Type:
Small organic molecule
Emp. Form.:
C5H5NOS
Mol. Mass.:
127.164
SMILES:
On1ccccc1=S
: