Target
Beta-lactamase
Ligand
BDBM47591
Substrate
Meas. Tech.
Epi-absorbance-based dose response assay for common IMP-1 and VIM-2 inhibitors: biochemical high throughput screening assay to identify inhibitors of VIM-2 metallo-beta-lactamase
IC50
39757±n/a nM
Citation
 PubChem, PC Epi-absorbance-based dose response assay for common IMP-1 and VIM-2 inhibitors: biochemical high throughput screening assay to identify inhibitors of VIM-2 metallo-beta-lactamase PubChem Bioassay (2010)[AID] 
Target
Name:
Beta-lactamase
Synonyms:
Beta lactamase
Type:
Enzyme Catalytic Domain
Mol. Mass.:
31513.38
Organism:
Pseudomonas aeruginosa
Description:
gi_114881106
Residue:
286
  
Inhibitor
Name:
BDBM47591
Synonyms:
(6'-acetyloxy-3-oxidanylidene-spiro[2-benzofuran-1,9'-xanthene]-3'-yl) ethanoate MLS000722997 acetic acid (6'-acetoxy-3-keto-spiro[phthalan-1,9'-xanthene]-3'-yl) ester cid_65047
Type:
Small organic molecule
Emp. Form.:
C24H16O7
Mol. Mass.:
416.3796
SMILES:
CC(=O)Oc1ccc2c(Oc3cc(OC(C)=O)ccc3C22OC(=O)c3ccccc23)c1
: