Target
Beta-lactamase
Ligand
BDBM66136
Substrate
Meas. Tech.
Epi-absorbance-based dose response assay for common IMP-1 and VIM-2 inhibitors: biochemical high throughput screening assay to identify inhibitors of VIM-2 metallo-beta-lactamase
IC50
4473±n/a nM
Citation
 PubChem, PC Epi-absorbance-based dose response assay for common IMP-1 and VIM-2 inhibitors: biochemical high throughput screening assay to identify inhibitors of VIM-2 metallo-beta-lactamase PubChem Bioassay (2010)[AID] 
Target
Name:
Beta-lactamase
Synonyms:
Beta lactamase
Type:
Enzyme Catalytic Domain
Mol. Mass.:
31513.38
Organism:
Pseudomonas aeruginosa
Description:
gi_114881106
Residue:
286
  
Inhibitor
Name:
BDBM66136
Synonyms:
2-amino-5-(3-hydroxy-6-keto-xanthen-9-yl)benzoic acid 2-amino-5-(3-hydroxy-6-oxoxanthen-9-yl)benzoic acid MLS001216583 cid_3801816
Type:
Small organic molecule
Emp. Form.:
C20H13NO5
Mol. Mass.:
347.3209
SMILES:
Nc1ccc(cc1C(O)=O)-c1c2ccc(O)cc2oc2cc(=O)ccc12
: