Target
Beta-lactamase
Ligand
BDBM51914
Substrate
Meas. Tech.
Epi-absorbance-based dose response assay for common IMP-1 and VIM-2 inhibitors: biochemical high throughput screening assay to identify inhibitors of VIM-2 metallo-beta-lactamase
IC50
>59640±n/a nM
Citation
 PubChem, PC Epi-absorbance-based dose response assay for common IMP-1 and VIM-2 inhibitors: biochemical high throughput screening assay to identify inhibitors of VIM-2 metallo-beta-lactamase PubChem Bioassay (2010)[AID] 
Target
Name:
Beta-lactamase
Synonyms:
Beta lactamase
Type:
Enzyme Catalytic Domain
Mol. Mass.:
31513.38
Organism:
Pseudomonas aeruginosa
Description:
gi_114881106
Residue:
286
  
Inhibitor
Name:
BDBM51914
Synonyms:
2-(diethylamino)ethyl 4-[[(Z)-2-cyano-2-[4-(2-oxidanylidenechromen-3-yl)-1,3-thiazol-2-yl]ethenyl]amino]benzoate 4-[[(Z)-2-cyano-2-[4-(2-ketochromen-3-yl)thiazol-2-yl]vinyl]amino]benzoic acid 2-(diethylamino)ethyl ester MLS001164950 cid_1837712
Type:
Small organic molecule
Emp. Form.:
C28H26N4O4S
Mol. Mass.:
514.595
SMILES:
CCN(CC)CCOC(=O)c1ccc(cc1)N=CC(C#N)c1nc(cs1)-c1cc2ccccc2oc1=O
: