Target
Beta-lactamase
Ligand
BDBM32050
Substrate
Meas. Tech.
Epi-absorbance-based dose response assay for common IMP-1 and VIM-2 inhibitors: biochemical high throughput counterscreen to identify inhibitors of TEM-1 metallo-beta-lactamase
IC50
3019±n/a nM
Citation
 PubChem, PC Epi-absorbance-based dose response assay for common IMP-1 and VIM-2 inhibitors: biochemical high throughput counterscreen to identify inhibitors of TEM-1 metallo-beta-lactamase PubChem Bioassay (2010)[AID] 
Target
Name:
Beta-lactamase
Synonyms:
Type:
Enzyme Catalytic Domain
Mol. Mass.:
29494.42
Organism:
Salmonella enterica subsp. enterica serovar Choleraesuis str. SC-B67
Description:
gi_60115532
Residue:
269
  
Inhibitor
Name:
BDBM32050
Synonyms:
MLS000080844 cid_663844
Type:
Small organic molecule
Emp. Form.:
C20H16N4O2
Mol. Mass.:
344.3666
SMILES:
O=C1c2ccccc2-c2onc3ccc(NCCCn4ccnc4)c1c23
: