Target
Beta-lactamase
Ligand
BDBM50972
Substrate
Meas. Tech.
Epi-absorbance-based dose response assay for common IMP-1 and VIM-2 inhibitors: biochemical high throughput counterscreen to identify inhibitors of TEM-1 metallo-beta-lactamase
IC50
7866±n/a nM
Citation
 PubChem, PC Epi-absorbance-based dose response assay for common IMP-1 and VIM-2 inhibitors: biochemical high throughput counterscreen to identify inhibitors of TEM-1 metallo-beta-lactamase PubChem Bioassay (2010)[AID] 
Target
Name:
Beta-lactamase
Synonyms:
Type:
Enzyme Catalytic Domain
Mol. Mass.:
29494.42
Organism:
Salmonella enterica subsp. enterica serovar Choleraesuis str. SC-B67
Description:
gi_60115532
Residue:
269
  
Inhibitor
Name:
BDBM50972
Synonyms:
8-amino-3-butyl-1H-benzo[g]pteridine-2,4-dione 8-amino-3-butylbenzo[g]pteridine-2,4(1H,3H)-dione MLS000573067 cid_5599490
Type:
Small organic molecule
Emp. Form.:
C14H15N5O2
Mol. Mass.:
285.3012
SMILES:
CCCCn1c(=O)[nH]c2nc3cc(N)ccc3nc2c1=O
: