Target
Beta-lactamase
Ligand
BDBM47374
Substrate
Meas. Tech.
Epi-absorbance-based dose response assay for common IMP-1 and VIM-2 inhibitors: biochemical high throughput counterscreen to identify inhibitors of TEM-1 metallo-beta-lactamase
IC50
1466±n/a nM
Citation
 PubChem, PC Epi-absorbance-based dose response assay for common IMP-1 and VIM-2 inhibitors: biochemical high throughput counterscreen to identify inhibitors of TEM-1 metallo-beta-lactamase PubChem Bioassay (2010)[AID] 
Target
Name:
Beta-lactamase
Synonyms:
Type:
Enzyme Catalytic Domain
Mol. Mass.:
29494.42
Organism:
Salmonella enterica subsp. enterica serovar Choleraesuis str. SC-B67
Description:
gi_60115532
Residue:
269
  
Inhibitor
Name:
BDBM47374
Synonyms:
2-[7-[butyl(methyl)amino]-4,4a,5,6-tetrahydro-3H-naphthalen-2-ylidene]malononitrile UNM000011096501 | cid_4076033
Type:
Small organic molecule
Emp. Form.:
C18H23N3
Mol. Mass.:
281.3953
SMILES:
[#6]-[#6]-[#6]-[#6]-[#7](-[#6])-[#6]-1=[#6]-[#6]-2=[#6]\[#6](-[#6]-[#6]-[#6]-2-[#6]-[#6]-1)=[#6](/C#N)C#N
: