Target
Beta-lactamase
Ligand
BDBM66134
Substrate
Meas. Tech.
Epi-absorbance-based dose response assay for common IMP-1 and VIM-2 inhibitors: biochemical high throughput counterscreen to identify inhibitors of TEM-1 metallo-beta-lactamase
IC50
6945±n/a nM
Citation
 PubChem, PC Epi-absorbance-based dose response assay for common IMP-1 and VIM-2 inhibitors: biochemical high throughput counterscreen to identify inhibitors of TEM-1 metallo-beta-lactamase PubChem Bioassay (2010)[AID] 
Target
Name:
Beta-lactamase
Synonyms:
Type:
Enzyme Catalytic Domain
Mol. Mass.:
29494.42
Organism:
Salmonella enterica subsp. enterica serovar Choleraesuis str. SC-B67
Description:
gi_60115532
Residue:
269
  
Inhibitor
Name:
BDBM66134
Synonyms:
2-[(1,1-diketo-1,2-benzothiazol-3-yl)-[[4-(dimethylamino)benzylidene]amino]amino]ethanol 2-[[[4-(dimethylamino)phenyl]methylideneamino]-(1,1-dioxo-1,2-benzothiazol-3-yl)amino]ethanol MLS001196408 cid_4002873
Type:
Small organic molecule
Emp. Form.:
C18H20N4O3S
Mol. Mass.:
372.441
SMILES:
CN(C)c1ccc(C=NN(CCO)C2=NS(=O)(=O)c3ccccc23)cc1
: