Target
Beta-lactamase
Ligand
BDBM61747
Substrate
Meas. Tech.
Epi-absorbance-based dose response assay for common IMP-1 and VIM-2 inhibitors: biochemical high throughput counterscreen to identify inhibitors of TEM-1 metallo-beta-lactamase
IC50
>59640±n/a nM
Citation
 PubChem, PC Epi-absorbance-based dose response assay for common IMP-1 and VIM-2 inhibitors: biochemical high throughput counterscreen to identify inhibitors of TEM-1 metallo-beta-lactamase PubChem Bioassay (2010)[AID] 
Target
Name:
Beta-lactamase
Synonyms:
Type:
Enzyme Catalytic Domain
Mol. Mass.:
29494.42
Organism:
Salmonella enterica subsp. enterica serovar Choleraesuis str. SC-B67
Description:
gi_60115532
Residue:
269
  
Inhibitor
Name:
BDBM61747
Synonyms:
3-nitro-4-[2-(1-thiophen-2-ylethylidene)hydrazinyl]benzenesulfonamide MLS001175204 cid_4192102
Type:
Small organic molecule
Emp. Form.:
C12H12N4O4S2
Mol. Mass.:
340.378
SMILES:
CC(N=Nc1ccc(cc1[N+]([O-])=O)S(N)(=O)=O)c1cccs1
: