Target
Beta-lactamase
Ligand
BDBM66108
Substrate
Meas. Tech.
Epi-absorbance-based dose response assay for common IMP-1 and VIM-2 inhibitors: biochemical high throughput screening assay to identify inhibitors of IMP-1metallo-beta-lactamase
IC50
23509±n/a nM
Citation
 PubChem, PC Epi-absorbance-based dose response assay for common IMP-1 and VIM-2 inhibitors: biochemical high throughput screening assay to identify inhibitors of IMP-1metallo-beta-lactamase PubChem Bioassay (2010)[AID] 
Target
Name:
Beta-lactamase
Synonyms:
Beta-lactamase | metallo-beta-lactamase IMP-1
Type:
Enzyme Catalytic Domain
Mol. Mass.:
27125.88
Organism:
Pseudomonas aeruginosa
Description:
gi_27368096
Residue:
246
  
Inhibitor
Name:
BDBM66108
Synonyms:
2-(4-methoxyphenyl)-3,4-furandicarboxylic acid MLS000530555 cid_2264893
Type:
Small organic molecule
Emp. Form.:
C13H10O6
Mol. Mass.:
262.2149
SMILES:
COc1ccc(cc1)-c1occ(C(O)=O)c1C(O)=O
: