Target
Beta-lactamase
Ligand
BDBM66119
Substrate
Meas. Tech.
Epi-absorbance-based dose response assay for common IMP-1 and VIM-2 inhibitors: biochemical high throughput screening assay to identify inhibitors of IMP-1metallo-beta-lactamase
IC50
>59640±n/a nM
Citation
 PubChem, PC Epi-absorbance-based dose response assay for common IMP-1 and VIM-2 inhibitors: biochemical high throughput screening assay to identify inhibitors of IMP-1metallo-beta-lactamase PubChem Bioassay (2010)[AID] 
Target
Name:
Beta-lactamase
Synonyms:
Beta-lactamase | metallo-beta-lactamase IMP-1
Type:
Enzyme Catalytic Domain
Mol. Mass.:
27125.88
Organism:
Pseudomonas aeruginosa
Description:
gi_27368096
Residue:
246
  
Inhibitor
Name:
BDBM66119
Synonyms:
(3Z)-2-cyclohexylidene-3-[(1-methyl-3-indolyl)methylidene]butanedioic acid (3Z)-2-cyclohexylidene-3-[(1-methylindol-3-yl)methylidene]butanedioic acid MLS000673730 cid_875062
Type:
Small organic molecule
Emp. Form.:
C20H21NO4
Mol. Mass.:
339.385
SMILES:
[#6]-n1cc(\[#6]=[#6](/[#6](-[#8])=O)\[#6](\[#6](-[#8])=O)=[#6]-2\[#6]-[#6]-[#6]-[#6]-[#6]-2)c2ccccc12
: