Target
Beta-lactamase
Ligand
BDBM66121
Substrate
Meas. Tech.
Epi-absorbance-based dose response assay for common IMP-1 and VIM-2 inhibitors: biochemical high throughput screening assay to identify inhibitors of IMP-1metallo-beta-lactamase
IC50
1024±n/a nM
Citation
 PubChem, PC Epi-absorbance-based dose response assay for common IMP-1 and VIM-2 inhibitors: biochemical high throughput screening assay to identify inhibitors of IMP-1metallo-beta-lactamase PubChem Bioassay (2010)[AID] 
Target
Name:
Beta-lactamase
Synonyms:
Beta-lactamase | metallo-beta-lactamase IMP-1
Type:
Enzyme Catalytic Domain
Mol. Mass.:
27125.88
Organism:
Pseudomonas aeruginosa
Description:
gi_27368096
Residue:
246
  
Inhibitor
Name:
BDBM66121
Synonyms:
(2E)-2-(dimethylaminomethylene)pyrrol[1,2-a]indole-1,4-quinone 2-[1-Dimethylamino-meth-(E)-ylidene]-2H-pyrrolo[1,2-a]indole-3,9-dione SMR000425528 | cid_776411
Type:
Small organic molecule
Emp. Form.:
C14H12N2O2
Mol. Mass.:
240.2573
SMILES:
CN(C)\C=C1/C=C2N(C1=O)c1ccccc1C2=O
: