Target
Beta-lactamase
Ligand
BDBM61118
Substrate
Meas. Tech.
Epi-absorbance-based dose response assay for common IMP-1 and VIM-2 inhibitors: biochemical high throughput screening assay to identify inhibitors of IMP-1metallo-beta-lactamase
IC50
>59640±n/a nM
Citation
 PubChem, PC Epi-absorbance-based dose response assay for common IMP-1 and VIM-2 inhibitors: biochemical high throughput screening assay to identify inhibitors of IMP-1metallo-beta-lactamase PubChem Bioassay (2010)[AID] 
Target
Name:
Beta-lactamase
Synonyms:
Beta-lactamase | metallo-beta-lactamase IMP-1
Type:
Enzyme Catalytic Domain
Mol. Mass.:
27125.88
Organism:
Pseudomonas aeruginosa
Description:
gi_27368096
Residue:
246
  
Inhibitor
Name:
BDBM61118
Synonyms:
1-(2-Methoxy-phenyl)-3-(4-nitro-phenyl)-5-phenyl-4,5-dihydro-1H-pyrazole 2-(2-methoxyphenyl)-5-(4-nitrophenyl)-3-phenyl-3,4-dihydropyrazole SMR000515423 | cid_2865835
Type:
Small organic molecule
Emp. Form.:
C22H19N3O3
Mol. Mass.:
373.4046
SMILES:
COc1ccccc1[N+]1=N[C-](CC1c1ccccc1)c1ccc(cc1)[N+]([O-])=O
: