Target
Beta-lactamase
Ligand
BDBM66148
Substrate
Meas. Tech.
Epi-absorbance-based dose response assay for common IMP-1 and VIM-2 inhibitors: biochemical high throughput screening assay to identify inhibitors of IMP-1metallo-beta-lactamase
IC50
10938±n/a nM
Citation
 PubChem, PC Epi-absorbance-based dose response assay for common IMP-1 and VIM-2 inhibitors: biochemical high throughput screening assay to identify inhibitors of IMP-1metallo-beta-lactamase PubChem Bioassay (2010)[AID] 
Target
Name:
Beta-lactamase
Synonyms:
Beta-lactamase | metallo-beta-lactamase IMP-1
Type:
Enzyme Catalytic Domain
Mol. Mass.:
27125.88
Organism:
Pseudomonas aeruginosa
Description:
gi_27368096
Residue:
246
  
Inhibitor
Name:
BDBM66148
Synonyms:
MLS001224570 N-[1-[4-(p-anisoylamino)phenyl]ethylideneamino]isonicotinamide N-[1-[4-[(4-methoxyphenyl)carbonylamino]phenyl]ethylideneamino]pyridine-4-carboxamide SMR000679031 | cid_4299664
Type:
Small organic molecule
Emp. Form.:
C22H20N4O3
Mol. Mass.:
388.4192
SMILES:
COc1ccc(cc1)C(=O)Nc1ccc(cc1)C(C)=NNC(=O)c1ccncc1
: