Target
Photoreceptor-specific nuclear receptor
Ligand
BDBM32102
Substrate
Meas. Tech.
TR-FRET-based biochemical high throughput dose response assay for agonists of nuclear receptor subfamily 2, group E, member 3 (NR2E3)
IC50
>39841±n/a nM
Citation
 PubChem, PC TR-FRET-based biochemical high throughput dose response assay for agonists of nuclear receptor subfamily 2, group E, member 3 (NR2E3) PubChem Bioassay (2010)[AID] 
Target
Name:
Photoreceptor-specific nuclear receptor
Synonyms:
NR2E3 PNR photoreceptor-specific nuclear receptor
Type:
PROTEIN
Mol. Mass.:
44699.83
Organism:
Homo sapiens (Human)
Description:
ChEMBL_401901
Residue:
410
  
Inhibitor
Name:
BDBM32102
Synonyms:
1,6-dimethylpyrimido[5,4-e][1,2,4]triazine-5,7(1H,6H)-dione 1,6-dimethylpyrimido[5,4-e][1,2,4]triazine-5,7-quinone SMR000024051 US9738628, Compound PKF118-310 | cid_66541
Type:
Small organic molecule
Emp. Form.:
C7H7N5O2
Mol. Mass.:
193.1628
SMILES:
Cn1ncnc2c1nc(=O)n(C)c2=O
: