Target
Photoreceptor-specific nuclear receptor
Ligand
BDBM42816
Substrate
Meas. Tech.
TR-FRET-based biochemical high throughput dose response assay for agonists of nuclear receptor subfamily 2, group E, member 3 (NR2E3)
IC50
1056±n/a nM
Citation
 PubChem, PC TR-FRET-based biochemical high throughput dose response assay for agonists of nuclear receptor subfamily 2, group E, member 3 (NR2E3) PubChem Bioassay (2010)[AID] 
Target
Name:
Photoreceptor-specific nuclear receptor
Synonyms:
NR2E3 PNR photoreceptor-specific nuclear receptor
Type:
PROTEIN
Mol. Mass.:
44699.83
Organism:
Homo sapiens (Human)
Description:
ChEMBL_401901
Residue:
410
  
Inhibitor
Name:
BDBM42816
Synonyms:
6-(2-keto-5-methyl-imidazolidin-4-yl)-N-phenethyl-hexanamide 6-(5-methyl-2-oxo-4-imidazolidinyl)-N-(2-phenylethyl)hexanamide MLS000052067 cid_2974150
Type:
Small organic molecule
Emp. Form.:
C18H27N3O2
Mol. Mass.:
317.4259
SMILES:
CC1NC(=O)NC1CCCCCC(=O)NCCc1ccccc1
: