Target
Photoreceptor-specific nuclear receptor
Ligand
BDBM66160
Substrate
Meas. Tech.
TR-FRET-based biochemical high throughput dose response assay for agonists of nuclear receptor subfamily 2, group E, member 3 (NR2E3)
IC50
>39841±n/a nM
Citation
 PubChem, PC TR-FRET-based biochemical high throughput dose response assay for agonists of nuclear receptor subfamily 2, group E, member 3 (NR2E3) PubChem Bioassay (2010)[AID] 
Target
Name:
Photoreceptor-specific nuclear receptor
Synonyms:
NR2E3 PNR photoreceptor-specific nuclear receptor
Type:
PROTEIN
Mol. Mass.:
44699.83
Organism:
Homo sapiens (Human)
Description:
ChEMBL_401901
Residue:
410
  
Inhibitor
Name:
BDBM66160
Synonyms:
2-(4-benzofuro[3,2-d]pyrimidinylthio)-N-(3-methylphenyl)acetamide 2-([1]benzofuro[3,2-d]pyrimidin-4-ylsulfanyl)-N-(3-methylphenyl)ethanamide MLS000101480 cid_3452486
Type:
Small organic molecule
Emp. Form.:
C19H15N3O2S
Mol. Mass.:
349.406
SMILES:
Cc1cccc(NC(=O)CSc2ncnc3c4ccccc4oc23)c1
: