Target
Photoreceptor-specific nuclear receptor
Ligand
BDBM40314
Substrate
Meas. Tech.
TR-FRET-based biochemical high throughput dose response assay for agonists of nuclear receptor subfamily 2, group E, member 3 (NR2E3)
IC50
>39841±n/a nM
Citation
 PubChem, PC TR-FRET-based biochemical high throughput dose response assay for agonists of nuclear receptor subfamily 2, group E, member 3 (NR2E3) PubChem Bioassay (2010)[AID] 
Target
Name:
Photoreceptor-specific nuclear receptor
Synonyms:
NR2E3 PNR photoreceptor-specific nuclear receptor
Type:
PROTEIN
Mol. Mass.:
44699.83
Organism:
Homo sapiens (Human)
Description:
ChEMBL_401901
Residue:
410
  
Inhibitor
Name:
BDBM40314
Synonyms:
3-(4-Chloro-phenyl)-1,6-dimethyl-1H-pyrimido[5,4-e][1,2,4]triazine-5,7-dione 3-(4-chlorophenyl)-1,6-dimethyl-pyrimido[5,4-e][1,2,4]triazine-5,7-quinone MLS000523518 US9073941, 603 | cid_460749
Type:
Small organic molecule
Emp. Form.:
C13H10ClN5O2
Mol. Mass.:
303.704
SMILES:
Cn1nc(nc2c1nc(=O)n(C)c2=O)-c1ccc(Cl)cc1
: