Target
Photoreceptor-specific nuclear receptor
Ligand
BDBM66178
Substrate
Meas. Tech.
TR-FRET-based biochemical high throughput dose response assay for agonists of nuclear receptor subfamily 2, group E, member 3 (NR2E3)
IC50
2092±n/a nM
Citation
 PubChem, PC TR-FRET-based biochemical high throughput dose response assay for agonists of nuclear receptor subfamily 2, group E, member 3 (NR2E3) PubChem Bioassay (2010)[AID] 
Target
Name:
Photoreceptor-specific nuclear receptor
Synonyms:
NR2E3 PNR photoreceptor-specific nuclear receptor
Type:
PROTEIN
Mol. Mass.:
44699.83
Organism:
Homo sapiens (Human)
Description:
ChEMBL_401901
Residue:
410
  
Inhibitor
Name:
BDBM66178
Synonyms:
3-(4-fluorophenyl)-2-sulfanylidene-1H-[1]benzofuro[3,2-d]pyrimidin-4-one 3-(4-fluorophenyl)-2-thioxo-1H-benzofuro[3,2-d]pyrimidin-4-one MLS000730173 cid_7120050
Type:
Small organic molecule
Emp. Form.:
C16H9FN2O2S
Mol. Mass.:
312.318
SMILES:
Fc1ccc(cc1)-n1c(=S)[nH]c2c3ccccc3oc2c1=O
: