Target
Photoreceptor-specific nuclear receptor
Ligand
BDBM66190
Substrate
Meas. Tech.
TR-FRET-based biochemical high throughput dose response assay for agonists of nuclear receptor subfamily 2, group E, member 3 (NR2E3)
IC50
8407±n/a nM
Citation
 PubChem, PC TR-FRET-based biochemical high throughput dose response assay for agonists of nuclear receptor subfamily 2, group E, member 3 (NR2E3) PubChem Bioassay (2010)[AID] 
Target
Name:
Photoreceptor-specific nuclear receptor
Synonyms:
NR2E3 PNR photoreceptor-specific nuclear receptor
Type:
PROTEIN
Mol. Mass.:
44699.83
Organism:
Homo sapiens (Human)
Description:
ChEMBL_401901
Residue:
410
  
Inhibitor
Name:
BDBM66190
Synonyms:
2-amino-6-(dicyanomethylene)-4-phenyl-1H-pyridine-3,5-dicarbonitrile 2-azanyl-6-(dicyanomethylidene)-4-phenyl-1H-pyridine-3,5-dicarbonitrile SMR000539348 | cid_910973
Type:
Small organic molecule
Emp. Form.:
C16H8N6
Mol. Mass.:
284.2749
SMILES:
Nc1nc(C(C#N)C#N)c(C#N)c(-c2ccccc2)c1C#N
: