Target
Photoreceptor-specific nuclear receptor
Ligand
BDBM55062
Substrate
Meas. Tech.
TR-FRET-based biochemical high throughput dose response assay for agonists of nuclear receptor subfamily 2, group E, member 3 (NR2E3)
IC50
5733±n/a nM
Citation
 PubChem, PC TR-FRET-based biochemical high throughput dose response assay for agonists of nuclear receptor subfamily 2, group E, member 3 (NR2E3) PubChem Bioassay (2010)[AID] 
Target
Name:
Photoreceptor-specific nuclear receptor
Synonyms:
NR2E3 PNR photoreceptor-specific nuclear receptor
Type:
PROTEIN
Mol. Mass.:
44699.83
Organism:
Homo sapiens (Human)
Description:
ChEMBL_401901
Residue:
410
  
Inhibitor
Name:
BDBM55062
Synonyms:
3-(5-methylfuran-2-yl)carbonyl-4-oxidanyl-2-(3-phenoxyphenyl)-1-(pyridin-3-ylmethyl)-2H-pyrrol-5-one 4-hydroxy-3-(5-methylfuran-2-carbonyl)-2-(3-phenoxyphenyl)-1-(pyridin-3-ylmethyl)-2H-pyrrol-5-one MLS001083034 cid_2911077
Type:
Small organic molecule
Emp. Form.:
C28H22N2O5
Mol. Mass.:
466.4847
SMILES:
Cc1ccc(o1)C(=O)C1C(N(Cc2cccnc2)C(=O)C1=O)c1cccc(Oc2ccccc2)c1
: