Target
Photoreceptor-specific nuclear receptor
Ligand
BDBM54993
Substrate
Meas. Tech.
TR-FRET-based biochemical high throughput dose response assay for agonists of nuclear receptor subfamily 2, group E, member 3 (NR2E3)
IC50
>39841±n/a nM
Citation
 PubChem, PC TR-FRET-based biochemical high throughput dose response assay for agonists of nuclear receptor subfamily 2, group E, member 3 (NR2E3) PubChem Bioassay (2010)[AID] 
Target
Name:
Photoreceptor-specific nuclear receptor
Synonyms:
NR2E3 PNR photoreceptor-specific nuclear receptor
Type:
PROTEIN
Mol. Mass.:
44699.83
Organism:
Homo sapiens (Human)
Description:
ChEMBL_401901
Residue:
410
  
Inhibitor
Name:
BDBM54993
Synonyms:
4-[6-(diethylamino)-3-(diethyliminio)-3H-xanthen-9-yl]benzene-1,3-disulfonate SMR000554424 sodium;4-[3-(diethylamino)-6-diethylazaniumylidene-xanthen-9-yl]benzene-1,3-disulfonate sodium;4-[3-(diethylamino)-6-diethyliminio-9-xanthenyl]benzene-1,3-disulfonate | sodium;4-[3-(diethylamino)-6-diethyliminio-xanthen-9-yl]benzene-1,3-disulfonate
Type:
Small organic molecule
Emp. Form.:
C27H29N2O7S2
Mol. Mass.:
557.659
SMILES:
CCN(CC)c1ccc2c(-c3ccc(cc3S([O-])(=O)=O)S([O-])(=O)=O)c3ccc(cc3oc2c1)=[N+](CC)CC
: