Target
Photoreceptor-specific nuclear receptor
Ligand
BDBM65718
Substrate
Meas. Tech.
TR-FRET-based biochemical high throughput dose response assay for agonists of nuclear receptor subfamily 2, group E, member 3 (NR2E3)
IC50
>39841±n/a nM
Citation
 PubChem, PC TR-FRET-based biochemical high throughput dose response assay for agonists of nuclear receptor subfamily 2, group E, member 3 (NR2E3) PubChem Bioassay (2010)[AID] 
Target
Name:
Photoreceptor-specific nuclear receptor
Synonyms:
NR2E3 PNR photoreceptor-specific nuclear receptor
Type:
PROTEIN
Mol. Mass.:
44699.83
Organism:
Homo sapiens (Human)
Description:
ChEMBL_401901
Residue:
410
  
Inhibitor
Name:
BDBM65718
Synonyms:
3-(1-benzofuran-2-carbonyl)-4-hydroxy-1-(5-methyl-1,2-oxazol-3-yl)-2-thiophen-2-yl-2H-pyrrol-5-one 3-[2-benzofuranyl(oxo)methyl]-4-hydroxy-1-(5-methyl-3-isoxazolyl)-2-thiophen-2-yl-2H-pyrrol-5-one MLS001146226 cid_3494131
Type:
Small organic molecule
Emp. Form.:
C21H14N2O5S
Mol. Mass.:
406.411
SMILES:
Cc1cc(no1)N1C(C(C(=O)c2cc3ccccc3o2)C(=O)C1=O)c1cccs1
: