Target
Isoform 2 of Nuclear receptor corepressor 2 (TRAC-1)
Ligand
BDBM47055
Substrate
Meas. Tech.
Counterscreen for agonists of nuclear receptor subfamily 2, group E, member 3 (NR2E3)
IC50
5043±n/a nM
Citation
 PubChem, PC Counterscreen for agonists of nuclear receptor subfamily 2, group E, member 3 (NR2E3): TR-FRET-based biochemical high throughput dose response assay to identify agonists of the interaction between peroxisome proliferator-activated receptor gamma (PPARg) and nuclear receptor co-repressor 2 (NCOR2) PubChem Bioassay (2010)[AID] 
Target
Name:
Isoform 2 of Nuclear receptor corepressor 2 (TRAC-1)
Synonyms:
CTG26 NCOR2_HUMAN nuclear receptor corepressor 2 isoform 2
Type:
Enzyme Catalytic Domain
Mol. Mass.:
81401.89
Organism:
Homo sapiens (Human)
Description:
Q9Y618-2 gi_116256445
Residue:
766
  
Inhibitor
Name:
BDBM47055
Synonyms:
3-(1-benzofuran-2-carbonyl)-1-[3-(dimethylamino)propyl]-4-hydroxy-2-phenyl-2H-pyrrol-5-one 3-[2-benzofuranyl(oxo)methyl]-1-[3-(dimethylamino)propyl]-4-hydroxy-2-phenyl-2H-pyrrol-5-one MLS000077721 cid_661074
Type:
Small organic molecule
Emp. Form.:
C24H24N2O4
Mol. Mass.:
404.4584
SMILES:
CN(C)CCCN1C(C(C(=O)c2cc3ccccc3o2)C(=O)C1=O)c1ccccc1
: