Target
Isoform 2 of Nuclear receptor corepressor 2 (TRAC-1)
Ligand
BDBM41042
Substrate
Meas. Tech.
Counterscreen for agonists of nuclear receptor subfamily 2, group E, member 3 (NR2E3)
IC50
208.72±n/a nM
Citation
 PubChem, PC Counterscreen for agonists of nuclear receptor subfamily 2, group E, member 3 (NR2E3): TR-FRET-based biochemical high throughput dose response assay to identify agonists of the interaction between peroxisome proliferator-activated receptor gamma (PPARg) and nuclear receptor co-repressor 2 (NCOR2) PubChem Bioassay (2010)[AID] 
Target
Name:
Isoform 2 of Nuclear receptor corepressor 2 (TRAC-1)
Synonyms:
CTG26 NCOR2_HUMAN nuclear receptor corepressor 2 isoform 2
Type:
Enzyme Catalytic Domain
Mol. Mass.:
81401.89
Organism:
Homo sapiens (Human)
Description:
Q9Y618-2 gi_116256445
Residue:
766
  
Inhibitor
Name:
BDBM41042
Synonyms:
7-(4-fluorophenyl)-5-(4-methylphenyl)-4-pyrido[2,3-d]pyrimidinamine 7-(4-fluorophenyl)-5-(4-methylphenyl)pyrido[2,3-d]pyrimidin-4-ylamine SMR000161339 cid_1234281
Type:
Small organic molecule
Emp. Form.:
C20H15FN4
Mol. Mass.:
330.3583
SMILES:
Cc1ccc(cc1)-c1cc(nc2ncnc(N)c12)-c1ccc(F)cc1
: