Target
Isoform 2 of Nuclear receptor corepressor 2 (TRAC-1)
Ligand
BDBM47242
Substrate
Meas. Tech.
Counterscreen for agonists of nuclear receptor subfamily 2, group E, member 3 (NR2E3)
IC50
603.89±n/a nM
Citation
 PubChem, PC Counterscreen for agonists of nuclear receptor subfamily 2, group E, member 3 (NR2E3): TR-FRET-based biochemical high throughput dose response assay to identify agonists of the interaction between peroxisome proliferator-activated receptor gamma (PPARg) and nuclear receptor co-repressor 2 (NCOR2) PubChem Bioassay (2010)[AID] 
Target
Name:
Isoform 2 of Nuclear receptor corepressor 2 (TRAC-1)
Synonyms:
CTG26 NCOR2_HUMAN nuclear receptor corepressor 2 isoform 2
Type:
Enzyme Catalytic Domain
Mol. Mass.:
81401.89
Organism:
Homo sapiens (Human)
Description:
Q9Y618-2 gi_116256445
Residue:
766
  
Inhibitor
Name:
BDBM47242
Synonyms:
4-bromanyl-2-methyl-7,8,9,10-tetrahydro-6H-cyclohepta[b]quinoline-11-carboxylic acid MLS000579904 cid_975392
Type:
Small organic molecule
Emp. Form.:
C16H16BrNO2
Mol. Mass.:
334.208
SMILES:
Cc1cc(Br)c2nc3CCCCCc3c(C(O)=O)c2c1
: