Target
Isoform 2 of Nuclear receptor corepressor 2 (TRAC-1)
Ligand
BDBM66170
Substrate
Meas. Tech.
Counterscreen for agonists of nuclear receptor subfamily 2, group E, member 3 (NR2E3)
IC50
4928±n/a nM
Citation
 PubChem, PC Counterscreen for agonists of nuclear receptor subfamily 2, group E, member 3 (NR2E3): TR-FRET-based biochemical high throughput dose response assay to identify agonists of the interaction between peroxisome proliferator-activated receptor gamma (PPARg) and nuclear receptor co-repressor 2 (NCOR2) PubChem Bioassay (2010)[AID] 
Target
Name:
Isoform 2 of Nuclear receptor corepressor 2 (TRAC-1)
Synonyms:
CTG26 NCOR2_HUMAN nuclear receptor corepressor 2 isoform 2
Type:
Enzyme Catalytic Domain
Mol. Mass.:
81401.89
Organism:
Homo sapiens (Human)
Description:
Q9Y618-2 gi_116256445
Residue:
766
  
Inhibitor
Name:
BDBM66170
Synonyms:
3-(4-methoxyphenyl)-2-sulfanylidene-1H-[1]benzofuro[3,2-d]pyrimidin-4-one 3-(4-methoxyphenyl)-2-thioxo-1H-benzofuro[3,2-d]pyrimidin-4-one SMR000236839 | cid_7120051
Type:
Small organic molecule
Emp. Form.:
C17H12N2O3S
Mol. Mass.:
324.354
SMILES:
COc1ccc(cc1)-n1c(=S)[nH]c2c3ccccc3oc2c1=O
: