Target
Isoform 2 of Nuclear receptor corepressor 2 (TRAC-1)
Ligand
BDBM51771
Substrate
Meas. Tech.
Counterscreen for agonists of nuclear receptor subfamily 2, group E, member 3 (NR2E3)
IC50
4691±n/a nM
Citation
 PubChem, PC Counterscreen for agonists of nuclear receptor subfamily 2, group E, member 3 (NR2E3): TR-FRET-based biochemical high throughput dose response assay to identify agonists of the interaction between peroxisome proliferator-activated receptor gamma (PPARg) and nuclear receptor co-repressor 2 (NCOR2) PubChem Bioassay (2010)[AID] 
Target
Name:
Isoform 2 of Nuclear receptor corepressor 2 (TRAC-1)
Synonyms:
CTG26 NCOR2_HUMAN nuclear receptor corepressor 2 isoform 2
Type:
Enzyme Catalytic Domain
Mol. Mass.:
81401.89
Organism:
Homo sapiens (Human)
Description:
Q9Y618-2 gi_116256445
Residue:
766
  
Inhibitor
Name:
BDBM51771
Synonyms:
1,6-dimethyl-3-(2-pyridinyl)pyrimido[5,4-e][1,2,4]triazine-5,7(1H,6H)-dione 1,6-dimethyl-3-(2-pyridyl)pyrimido[5,4-e][1,2,4]triazine-5,7-quinone 1,6-dimethyl-3-pyridin-2-ylpyrimido[5,4-e][1,2,4]triazine-5,7-dione SMR000291658 | cid_906542
Type:
Small organic molecule
Emp. Form.:
C12H10N6O2
Mol. Mass.:
270.2468
SMILES:
Cn1nc(nc2c1nc(=O)n(C)c2=O)-c1ccccn1
: