Target
Isoform 2 of Nuclear receptor corepressor 2 (TRAC-1)
Ligand
BDBM66215
Substrate
Meas. Tech.
Counterscreen for agonists of nuclear receptor subfamily 2, group E, member 3 (NR2E3)
IC50
1835±n/a nM
Citation
 PubChem, PC Counterscreen for agonists of nuclear receptor subfamily 2, group E, member 3 (NR2E3): TR-FRET-based biochemical high throughput dose response assay to identify agonists of the interaction between peroxisome proliferator-activated receptor gamma (PPARg) and nuclear receptor co-repressor 2 (NCOR2) PubChem Bioassay (2010)[AID] 
Target
Name:
Isoform 2 of Nuclear receptor corepressor 2 (TRAC-1)
Synonyms:
CTG26 NCOR2_HUMAN nuclear receptor corepressor 2 isoform 2
Type:
Enzyme Catalytic Domain
Mol. Mass.:
81401.89
Organism:
Homo sapiens (Human)
Description:
Q9Y618-2 gi_116256445
Residue:
766
  
Inhibitor
Name:
BDBM66215
Synonyms:
3-(1-benzofuran-2-carbonyl)-2-(4-chlorophenyl)-4-hydroxy-1-(5-methyl-1,2-oxazol-3-yl)-2H-pyrrol-5-one 3-[2-benzofuranyl(oxo)methyl]-2-(4-chlorophenyl)-4-hydroxy-1-(5-methyl-3-isoxazolyl)-2H-pyrrol-5-one MLS001147779 cid_3805026
Type:
Small organic molecule
Emp. Form.:
C23H15ClN2O5
Mol. Mass.:
434.829
SMILES:
Cc1cc(no1)N1C(C(C(=O)c2cc3ccccc3o2)C(=O)C1=O)c1ccc(Cl)cc1
: