Target
Isoform 2 of Nuclear receptor corepressor 2 (TRAC-1)
Ligand
BDBM66219
Substrate
Meas. Tech.
Counterscreen for agonists of nuclear receptor subfamily 2, group E, member 3 (NR2E3)
IC50
16622±n/a nM
Citation
 PubChem, PC Counterscreen for agonists of nuclear receptor subfamily 2, group E, member 3 (NR2E3): TR-FRET-based biochemical high throughput dose response assay to identify agonists of the interaction between peroxisome proliferator-activated receptor gamma (PPARg) and nuclear receptor co-repressor 2 (NCOR2) PubChem Bioassay (2010)[AID] 
Target
Name:
Isoform 2 of Nuclear receptor corepressor 2 (TRAC-1)
Synonyms:
CTG26 NCOR2_HUMAN nuclear receptor corepressor 2 isoform 2
Type:
Enzyme Catalytic Domain
Mol. Mass.:
81401.89
Organism:
Homo sapiens (Human)
Description:
Q9Y618-2 gi_116256445
Residue:
766
  
Inhibitor
Name:
BDBM66219
Synonyms:
4-benzoxy-2-pyridone MLS001360006 cid_3607724
Type:
Small organic molecule
Emp. Form.:
C12H11NO2
Mol. Mass.:
201.2212
SMILES:
O=c1cc(OCc2ccccc2)cc[nH]1
: