Target
Bcl-2-like protein 11
Ligand
BDBM31081
Substrate
Meas. Tech.
Luminescence Cell-Based Dose Retest to Identify Inhibitors of A1 Apoptosis
EC50
>350000±n/a nM
Citation
 PubChem, PC Luminescence Cell-Based Dose Retest to Identify Inhibitors of A1 Apoptosis PubChem Bioassay (2010)[AID] 
Target
Name:
Bcl-2-like protein 11
Synonyms:
B2L11_HUMAN BCL2L11 | BIM
Type:
PROTEIN
Mol. Mass.:
22175.26
Organism:
Homo sapiens (Human)
Description:
EBI_101325
Residue:
198
  
Inhibitor
Name:
BDBM31081
Synonyms:
7-(hydroxymethyl)-2-(4-phenylphenyl)-4,7a-dihydro-3aH-octahydro-1H-4,7-epoxyisoindole-1,3-dione MLS000110473 cid_2899176
Type:
Small organic molecule
Emp. Form.:
C21H17NO4
Mol. Mass.:
347.364
SMILES:
[H]C12OC(CO)(C=C1)c1c(O)n(c(O)c21)-c1ccc(cc1)-c1ccccc1
: