Target
Bcl-2-like protein 11
Ligand
BDBM66365
Substrate
Meas. Tech.
Luminescence Cell-Based Dose Retest to Identify Inhibitors of A1 Apoptosis
EC50
110800±n/a nM
Citation
 PubChem, PC Luminescence Cell-Based Dose Retest to Identify Inhibitors of A1 Apoptosis PubChem Bioassay (2010)[AID] 
Target
Name:
Bcl-2-like protein 11
Synonyms:
B2L11_HUMAN BCL2L11 | BIM
Type:
PROTEIN
Mol. Mass.:
22175.26
Organism:
Homo sapiens (Human)
Description:
EBI_101325
Residue:
198
  
Inhibitor
Name:
BDBM66365
Synonyms:
2-[({[(2,5-dimethylphenyl)sulfonyl]amino}acetyl)amino]-6-methyl-4,5,6,7-tetrahydro-1-benzothiophene-3-carboxamide 2-[[2-[(2,5-dimethylphenyl)sulfonylamino]-1-oxoethyl]amino]-6-methyl-4,5,6,7-tetrahydro-1-benzothiophene-3-carboxamide 2-[[2-[(2,5-dimethylphenyl)sulfonylamino]acetyl]amino]-6-methyl-4,5,6,7-tetrahydrobenzothiophene-3-carboxamide SMR000162584 | cid_3595113
Type:
Small organic molecule
Emp. Form.:
C20H25N3O4S2
Mol. Mass.:
435.56
SMILES:
CC1CCc2c(C1)sc(NC(=O)CNS(=O)(=O)c1cc(C)ccc1C)c2C(N)=O
: