Target
Bcl-2-like protein 11
Ligand
BDBM66479
Substrate
Meas. Tech.
Luminescence Cell-Based Dose Retest to Identify Inhibitors of A1 Apoptosis
EC50
>350000±n/a nM
Citation
 PubChem, PC Luminescence Cell-Based Dose Retest to Identify Inhibitors of A1 Apoptosis PubChem Bioassay (2010)[AID] 
Target
Name:
Bcl-2-like protein 11
Synonyms:
B2L11_HUMAN BCL2L11 | BIM
Type:
PROTEIN
Mol. Mass.:
22175.26
Organism:
Homo sapiens (Human)
Description:
EBI_101325
Residue:
198
  
Inhibitor
Name:
BDBM66479
Synonyms:
(2S)-2-[(3,5-dimethoxybenzoyl)amino]-3-methyl-butyric acid [2-(2,4-dimethylanilino)-2-keto-ethyl] ester MLS000392449 [2-(2,4-dimethylanilino)-2-oxoethyl] (2S)-2-[(3,5-dimethoxybenzoyl)amino]-3-methylbutanoate cid_2405995
Type:
Small organic molecule
Emp. Form.:
C24H30N2O6
Mol. Mass.:
442.5048
SMILES:
COc1cc(OC)cc(c1)C(=O)N[C@@H](C(C)C)C(=O)OCC(=O)Nc1ccc(C)cc1C
: