Target
Bcl-2-like protein 11
Ligand
BDBM67060
Substrate
Meas. Tech.
Luminescence Cell-Based Dose Retest to Identify Inhibitors of A1 Apoptosis
EC50
106900±n/a nM
Citation
 PubChem, PC Luminescence Cell-Based Dose Retest to Identify Inhibitors of A1 Apoptosis PubChem Bioassay (2010)[AID] 
Target
Name:
Bcl-2-like protein 11
Synonyms:
B2L11_HUMAN BCL2L11 | BIM
Type:
PROTEIN
Mol. Mass.:
22175.26
Organism:
Homo sapiens (Human)
Description:
EBI_101325
Residue:
198
  
Inhibitor
Name:
BDBM67060
Synonyms:
1-[2-[4-(2-phenyl-1-benzothiophen-3-yl)phenoxy]ethyl]pyrrolidine MLS002473624 cid_44202267
Type:
Small organic molecule
Emp. Form.:
C26H25NOS
Mol. Mass.:
399.548
SMILES:
C(CN1CCCC1)Oc1ccc(cc1)-c1c(sc2ccccc12)-c1ccccc1
: