Target
Signal transducer and activator of transcription 3 [702-738,740-752]
Ligand
BDBM67110
Substrate
Meas. Tech.
Late stage counterscreen results from the probe development effort to identify STAT1 inhibitors: luminescence-based cell-based dose response assay for STAT3 inhibitors
IC50
>55690±n/a nM
Citation
 PubChem, PC Late stage counterscreen results from the probe development effort to identify STAT1 inhibitors: luminescence-based cell-based dose response assay for STAT3 inhibitors PubChem Bioassay (2010)[AID] 
Target
Name:
Signal transducer and activator of transcription 3 [702-738,740-752]
Synonyms:
APRF STAT3_HUMAN
Type:
Enzyme Catalytic Domain
Mol. Mass.:
5263.93
Organism:
Homo sapiens (Human)
Description:
gi_13272532
Residue:
50
  
Inhibitor
Name:
BDBM67110
Synonyms:
4-[4-[2-(3-chloro-4-methoxy-anilino)-2-keto-1-phenyl-ethyl]piperazino]sulfonylbenzoic acid ethyl ester SR-03000000779-1 ethyl 4-[4-[2-(3-chloro-4-methoxyanilino)-2-oxo-1-phenylethyl]piperazin-1-yl]sulfonylbenzoate | ethyl 4-[4-[2-[(3-chloranyl-4-methoxy-phenyl)amino]-2-oxidanylidene-1-phenyl-ethyl]piperazin-1-yl]sulfonylbenzoate
Type:
Small organic molecule
Emp. Form.:
C28H30ClN3O6S
Mol. Mass.:
572.072
SMILES:
CCOC(=O)c1ccc(cc1)S(=O)(=O)N1CCN(CC1)C(C(=O)Nc1ccc(OC)c(Cl)c1)c1ccccc1
: