Target
Signal transducer and activator of transcription 3 [702-738,740-752]
Ligand
BDBM67112
Substrate
Meas. Tech.
Late stage counterscreen results from the probe development effort to identify STAT1 inhibitors: luminescence-based cell-based dose response assay for STAT3 inhibitors
IC50
>55690±n/a nM
Citation
 PubChem, PC Late stage counterscreen results from the probe development effort to identify STAT1 inhibitors: luminescence-based cell-based dose response assay for STAT3 inhibitors PubChem Bioassay (2010)[AID] 
Target
Name:
Signal transducer and activator of transcription 3 [702-738,740-752]
Synonyms:
APRF STAT3_HUMAN
Type:
Enzyme Catalytic Domain
Mol. Mass.:
5263.93
Organism:
Homo sapiens (Human)
Description:
gi_13272532
Residue:
50
  
Inhibitor
Name:
BDBM67112
Synonyms:
2-(4-besylpiperazino)-2-phenyl-N-(p-tolyl)acetamide 2-[4-(benzenesulfonyl)piperazin-1-yl]-N-(4-methylphenyl)-2-phenylacetamide SR-03000000781-1 | cid_16323991
Type:
Small organic molecule
Emp. Form.:
C25H27N3O3S
Mol. Mass.:
449.565
SMILES:
Cc1ccc(NC(=O)C(N2CCN(CC2)S(=O)(=O)c2ccccc2)c2ccccc2)cc1
: