Target
Signal transducer and activator of transcription 1-alpha/beta
Ligand
BDBM67101
Substrate
Meas. Tech.
Late stage results from the probe development effort to identify STAT1 inhibitors: luminescence-based cell-based dose response assay for STAT1 inhibitors
IC50
>55690±n/a nM
Citation
 PubChem, PC Late stage results from the probe development effort to identify STAT1 inhibitors: luminescence-based cell-based dose response assay for STAT1 inhibitors PubChem Bioassay (2010)[AID] 
Target
Name:
Signal transducer and activator of transcription 1-alpha/beta
Synonyms:
STAT1 Signal transducer and activator of transcription 1-alpha/beta Transcription factor ISGF-3 components p91/p84 | signal transducer and activator of transcription 1 isoform alpha
Type:
Cytosolic Transcription Factor
Mol. Mass.:
87327.69
Organism:
Homo sapiens (Human)
Description:
Stat1 was expressed in sf9 cells from a baculovirus encoding the recombinant proteins. Stat1 dimer binds to DNA.
Residue:
750
  
Inhibitor
Name:
BDBM67101
Synonyms:
2-(4-besylpiperazino)-N-(4-fluorophenyl)-2-phenyl-acetamide 2-[4-(benzenesulfonyl)piperazin-1-yl]-N-(4-fluorophenyl)-2-phenylacetamide SR-01000699264-2 | cid_3431872
Type:
Small organic molecule
Emp. Form.:
C24H24FN3O3S
Mol. Mass.:
453.529
SMILES:
Fc1ccc(NC(=O)C(N2CCN(CC2)S(=O)(=O)c2ccccc2)c2ccccc2)cc1
: