Target
Signal transducer and activator of transcription 1-alpha/beta
Ligand
BDBM67125
Substrate
Meas. Tech.
Late stage results from the probe development effort to identify STAT1 inhibitors: luminescence-based cell-based dose response assay for STAT1 inhibitors
IC50
>55690±n/a nM
Citation
 PubChem, PC Late stage results from the probe development effort to identify STAT1 inhibitors: luminescence-based cell-based dose response assay for STAT1 inhibitors PubChem Bioassay (2010)[AID] 
Target
Name:
Signal transducer and activator of transcription 1-alpha/beta
Synonyms:
STAT1 Signal transducer and activator of transcription 1-alpha/beta Transcription factor ISGF-3 components p91/p84 | signal transducer and activator of transcription 1 isoform alpha
Type:
Cytosolic Transcription Factor
Mol. Mass.:
87327.69
Organism:
Homo sapiens (Human)
Description:
Stat1 was expressed in sf9 cells from a baculovirus encoding the recombinant proteins. Stat1 dimer binds to DNA.
Residue:
750
  
Inhibitor
Name:
BDBM67125
Synonyms:
3-(4-fluorophenyl)-4-keto-N-methyl-phthalazine-1-carboxamide 3-(4-fluorophenyl)-N-methyl-4-oxo-1-phthalazinecarboxamide SR-03000000850-1 | cid_1485890
Type:
Small organic molecule
Emp. Form.:
C16H12FN3O2
Mol. Mass.:
297.2838
SMILES:
CNC(=O)c1nn(-c2ccc(F)cc2)c(=O)c2ccccc12
: