Target
Signal transducer and activator of transcription 1-alpha/beta
Ligand
BDBM67131
Substrate
Meas. Tech.
Late stage results from the probe development effort to identify STAT1 inhibitors: luminescence-based cell-based dose response assay for STAT1 inhibitors
IC50
>55690±n/a nM
Citation
 PubChem, PC Late stage results from the probe development effort to identify STAT1 inhibitors: luminescence-based cell-based dose response assay for STAT1 inhibitors PubChem Bioassay (2010)[AID] 
Target
Name:
Signal transducer and activator of transcription 1-alpha/beta
Synonyms:
STAT1 Signal transducer and activator of transcription 1-alpha/beta Transcription factor ISGF-3 components p91/p84 | signal transducer and activator of transcription 1 isoform alpha
Type:
Cytosolic Transcription Factor
Mol. Mass.:
87327.69
Organism:
Homo sapiens (Human)
Description:
Stat1 was expressed in sf9 cells from a baculovirus encoding the recombinant proteins. Stat1 dimer binds to DNA.
Residue:
750
  
Inhibitor
Name:
BDBM67131
Synonyms:
4-keto-3-phenyl-phthalazine-1-carboxylic acid cyclohexylmethyl ester SR-03000000857-1 cyclohexylmethyl 4-oxidanylidene-3-phenyl-phthalazine-1-carboxylate | cyclohexylmethyl 4-oxo-3-phenylphthalazine-1-carboxylate
Type:
Small organic molecule
Emp. Form.:
C22H22N2O3
Mol. Mass.:
362.4217
SMILES:
O=C(OCC1CCCCC1)c1nn(-c2ccccc2)c(=O)c2ccccc12
: