Target
Signal transducer and activator of transcription 1-alpha/beta
Ligand
BDBM67140
Substrate
Meas. Tech.
Late stage results from the probe development effort to identify STAT1 inhibitors: luminescence-based cell-based dose response assay for STAT1 inhibitors
IC50
>55690±n/a nM
Citation
 PubChem, PC Late stage results from the probe development effort to identify STAT1 inhibitors: luminescence-based cell-based dose response assay for STAT1 inhibitors PubChem Bioassay (2010)[AID] 
Target
Name:
Signal transducer and activator of transcription 1-alpha/beta
Synonyms:
STAT1 Signal transducer and activator of transcription 1-alpha/beta Transcription factor ISGF-3 components p91/p84 | signal transducer and activator of transcription 1 isoform alpha
Type:
Cytosolic Transcription Factor
Mol. Mass.:
87327.69
Organism:
Homo sapiens (Human)
Description:
Stat1 was expressed in sf9 cells from a baculovirus encoding the recombinant proteins. Stat1 dimer binds to DNA.
Residue:
750
  
Inhibitor
Name:
BDBM67140
Synonyms:
6,7-dimethoxy-3-[[3-(2-methoxyphenyl)-1,2-oxazol-5-yl]methyl]-2-(morpholin-4-ylmethylidene)-1H-quinazolin-4-one 6,7-dimethoxy-3-[[3-(2-methoxyphenyl)isoxazol-5-yl]methyl]-2-(morpholinomethylene)-1H-quinazolin-4-one cid_44202998
Type:
Small organic molecule
Emp. Form.:
C26H28N4O6
Mol. Mass.:
492.5237
SMILES:
COc1cc2nc(CN3CCOCC3)n(Cc3cc(no3)-c3ccccc3OC)c(=O)c2cc1OC
: