Target
NADPH oxidase 1
Ligand
BDBM67142
Substrate
Meas. Tech.
Late-stage luminescence-based cell-based dose response assay to identify inhibitors of NADPH oxidase 1 (NOX1): Synthesized analogs 3
IC50
>20000±n/a nM
Citation
 PubChem, PC Late-stage luminescence-based cell-based dose response assay to identify inhibitors of NADPH oxidase 1 (NOX1): Synthesized analogs 3 PubChem Bioassay (2010)[AID] 
Target
Name:
NADPH oxidase 1
Synonyms:
MOX-1 Mitogenic oxidase 1 NOH-1 NOX-1 NOX1_HUMAN
Type:
PROTEIN
Mol. Mass.:
64890.44
Organism:
Homo sapiens (Human)
Description:
ChEMBL_792877
Residue:
564
  
Inhibitor
Name:
BDBM67142
Synonyms:
(10-methyl-3-phenothiazinyl)-phenylmethanone (10-methylphenothiazin-3-yl)-phenylmethanone SR-03000001206-1 | cid_44968110
Type:
Small organic molecule
Emp. Form.:
C20H15NOS
Mol. Mass.:
317.404
SMILES:
CN1c2ccccc2Sc2cc(ccc12)C(=O)c1ccccc1
: