Target
Apelin receptor
Ligand
BDBM67184
Substrate
Meas. Tech.
Dose Response confirmation of uHTS hits from a small molecule antagonists of the APJ receptor via a luminescent beta-arrestin assay
IC50
3010±n/a nM
Citation
 PubChem, PC Dose Response confirmation of uHTS hits from a small molecule antagonists of the APJ receptor via a luminescent beta-arrestin assay PubChem Bioassay (2010)[AID] 
Target
Name:
Apelin receptor
Synonyms:
AGTRL1 APJ_HUMAN Angiotensin receptor-like 1 Apelin receptor (APJ) G-protein coupled receptor HG11
Type:
Enzyme Catalytic Domain
Mol. Mass.:
42664.06
Organism:
Homo sapiens (Human)
Description:
P35414
Residue:
380
  
Inhibitor
Name:
BDBM67184
Synonyms:
1-[3-(4-bromanyl-3,5-dimethyl-pyrazol-1-yl)propanoylamino]-3-(2-methylpropyl)thiourea 1-[3-(4-bromo-3,5-dimethylpyrazol-1-yl)propanoylamino]-3-(2-methylpropyl)thiourea 2-[3-(4-bromo-3,5-dimethyl-1H-pyrazol-1-yl)propanoyl]-N-isobutylhydrazinecarbothioamide SMR000160245 | cid_1767917
Type:
Small organic molecule
Emp. Form.:
C13H22BrN5OS
Mol. Mass.:
376.316
SMILES:
CC(C)CNC(=S)NNC(=O)CCn1nc(C)c(Br)c1C
: