Target
Apelin receptor
Ligand
BDBM52665
Substrate
Meas. Tech.
Dose Response confirmation of uHTS hits from a small molecule antagonists of the APJ receptor via a luminescent beta-arrestin assay
IC50
2936±n/a nM
Citation
 PubChem, PC Dose Response confirmation of uHTS hits from a small molecule antagonists of the APJ receptor via a luminescent beta-arrestin assay PubChem Bioassay (2010)[AID] 
Target
Name:
Apelin receptor
Synonyms:
AGTRL1 APJ_HUMAN Angiotensin receptor-like 1 Apelin receptor (APJ) G-protein coupled receptor HG11
Type:
Enzyme Catalytic Domain
Mol. Mass.:
42664.06
Organism:
Homo sapiens (Human)
Description:
P35414
Residue:
380
  
Inhibitor
Name:
BDBM52665
Synonyms:
1-(5-acetyl-3-methyl-6-phenyl-5H-[1,2,4]triazolo[3,4-b][1,3,4]thiadiazin-7-yl)ethanone 1-(5-ethanoyl-3-methyl-6-phenyl-[1,2,4]triazolo[3,4-b][1,3,4]thiadiazin-7-yl)ethanone SMR000312275 | cid_5295671
Type:
Small organic molecule
Emp. Form.:
C15H14N4O2S
Mol. Mass.:
314.362
SMILES:
CC(=O)N1C(=C(Sc2nnc(C)n12)C(C)=O)c1ccccc1
: